Error / make insatll

Jairo CarneiroO\; jairoccjunior at gmail.com
Mon Mar 21 15:40:10 EDT 2011


hi, i have a error when make install.

   CCLD   timestamp.la
   CC     timestamp_format.lo
   CCLD   timestamp_format.la
   CC     xmppconsole.lo
   CCLD   xmppconsole.la
   CC     vvconfig.lo
vvconfig.c:29:42: error: gst/interfaces/propertyprobe.h: No such file or 
directory
vvconfig.c: In function 'get_element_devices':
vvconfig.c:82: error: 'GstPropertyProbe' undeclared (first use in this 
function)
vvconfig.c:82: error: (Each undeclared identifier is reported only once
vvconfig.c:82: error: for each function it appears in.)
vvconfig.c:82: error: 'probe' undeclared (first use in this function)
vvconfig.c:83: warning: ISO C90 forbids mixed declarations and code
vvconfig.c:95: error: implicit declaration of function 
'GST_IS_PROPERTY_PROBE'
vvconfig.c:96: error: implicit declaration of function 'GST_PROPERTY_PROBE'
vvconfig.c:97: error: implicit declaration of function 
'gst_property_probe_get_property'
vvconfig.c:111: error: implicit declaration of function 
'gst_property_probe_probe_and_get_values'
make[3]: *** [vvconfig.lo] Error 1
make[3]: Leaving directory 
`/home/jairo/DOWNLOADS-FIREFOX/pidgin-2.7.11/pidgin/plugins'
make[2]: *** [check-recursive] Error 1
make[2]: Leaving directory 
`/home/jairo/DOWNLOADS-FIREFOX/pidgin-2.7.11/pidgin/plugins'
make[1]: *** [check-recursive] Error 1
make[1]: Leaving directory 
`/home/jairo/DOWNLOADS-FIREFOX/pidgin-2.7.11/pidgin'
make: *** [check-recursive] Error 1
root at jairocarneiro:/home/jairo/DOWNLOADS-FIREFOX/pidgin-2.7.11#



More information about the Support mailing list