Building Pidgin Installer Trouble

Kevin Macksamie kevin.macksamie at gmail.com
Mon Jun 28 16:26:13 EDT 2010


Hi,

I am following the directions to building the offline installer found here:
http://developer.pidgin.im/wiki/BuildingWinPidgin. Whether I try to build
the offline or regular installer I end up with the same error. The error is
attached. I am unsure what to do.

Thanks,
-Kevin
-------------- next part --------------
An HTML attachment was scrubbed...
URL: <http://pidgin.im/pipermail/support/attachments/20100628/da7f7fa7/attachment.htm>
-------------- next part --------------
Processing plugin dlls: "C:\Progra~1\NSIS\Plugins\*.dll"
 - AdvSplash::show
 - Banner::destroy
 - Banner::getWindow
 - Banner::show
 - BgImage::AddImage
 - BgImage::AddText
 - BgImage::Clear
 - BgImage::Destroy
 - BgImage::Redraw
 - BgImage::SetBg
 - BgImage::SetReturn
 - BgImage::Sound
 - Dialer::AttemptConnect
 - Dialer::AutodialHangup
 - Dialer::AutodialOnline
 - Dialer::AutodialUnattended
 - Dialer::GetConnectedState
 - InstallOptions::dialog
 - InstallOptions::initDialog
 - InstallOptions::show
 - LangDLL::LangDialog
 - Math::Script
 - NSISdl::download
 - NSISdl::download_quiet
 - Splash::show
 - StartMenu::Init
 - StartMenu::Select
 - StartMenu::Show
 - System::Alloc
 - System::Call
 - System::Copy
 - System::Free
 - System::Get
 - System::Int64Op
 - System::Store
 - TypeLib::GetLibVersion
 - TypeLib::Register
 - TypeLib::UnRegister
 - UserInfo::GetAccountType
 - UserInfo::GetName
 - UserInfo::GetOriginalAccountType
 - VPatch::GetFileCRC32
 - VPatch::GetFileMD5
 - VPatch::vpatchfile
 - nsDialogs::Create
 - nsDialogs::CreateControl
 - nsDialogs::CreateItem
 - nsDialogs::CreateTimer
 - nsDialogs::GetUserData
 - nsDialogs::KillTimer
 - nsDialogs::OnBack
 - nsDialogs::OnChange
 - nsDialogs::OnClick
 - nsDialogs::OnNotify
 - nsDialogs::SelectFileDialog
 - nsDialogs::SelectFolderDialog
 - nsDialogs::SetRTL
 - nsDialogs::SetUserData
 - nsDialogs::Show
 - nsExec::Exec
 - nsExec::ExecToLog
 - nsExec::ExecToStack
 - nsisunz::Unzip
 - nsisunz::UnzipToLog
 - nsisunz::UnzipToStack
 - nsisunz::extract_RunDLL

!define expects 1-5 parameters, got 7.
Usage: !define ([/date|/utcdate] symbol [value]) | (/file symbol filename) | (/math symbol val1 OP val2)
    OP=(+ - * / % & | ^)
!include: error in script: ".\translations\uk.nsh" on line 13
Error in macro GCOMPRIS_MACRO_INCLUDE_LANGFILE on macroline 2
!include: error in script: ".\langmacros.nsh" on line 103
Error in script "pidgin/win32/nsis/pidgin-installer.nsi" on line 149 -- aborting creation process
make: *** [installer] Error 1


More information about the Support mailing list