OSx & sipe plugin any hints on getting the build to work

Nicholas English nik.english at gmail.com
Mon Apr 13 18:31:34 EDT 2009


Hi All,
I've been trying to build the pidgin-sipe 1.3.3 plugin as I need to access
Live Communication Server (LSC) on our domain :-(
The windows dll works fine but all my attempts to build one for OSX bug out.
I've tried macPorts & Fink
- Pidgin went in fine with MacPorts but

Fink always fails to build
<snip>
+ make
/bin/sh ./libtool --mode=compile cc -c -Os  -I../dist/..
../dist/../db_dump185/db_dump185.c
 cc -c -Os -I../dist/.. ../dist/../db_dump185/db_dump185.c  -fno-common
-DPIC -o .libs/db_dump185.o
../dist/../db_dump185/db_dump185.c: In function 'main':
../dist/../db_dump185/db_dump185.c:212: warning: assignment makes pointer
from integer without a cast
../dist/../db_dump185/db_dump185.c:214: warning: assignment makes pointer
from integer without a cast
../dist/../db_dump185/db_dump185.c:229: error: 'struct __db' has no member
named 'seq'
../dist/../db_dump185/db_dump185.c:229: error: 'R_NEXT' undeclared (first
use in this function)
../dist/../db_dump185/db_dump185.c:229: error: (Each undeclared identifier
is reported only once
../dist/../db_dump185/db_dump185.c:229: error: for each function it appears
in.)
../dist/../db_dump185/db_dump185.c:234: error: 'struct __db' has no member
named 'seq'
../dist/../db_dump185/db_dump185.c: In function 'db_hash':
../dist/../db_dump185/db_dump185.c:262: error: 'struct __db' has no member
named 'internal'
../dist/../db_dump185/db_dump185.c:264: error: 'struct __db' has no member
named 'internal'
../dist/../db_dump185/db_dump185.c: In function 'db_btree':
../dist/../db_dump185/db_dump185.c:289: error: 'struct __db' has no member
named 'internal'
make: *** [db_dump185.lo] Error 1
### execution of /var/tmp/tmp.1.p4kLV8 failed, exit code 2
Removing runtime build-lock...
Removing build-lock package...
/sw/bin/dpkg-lockwait -r fink-buildlock-db44-aes-4.4.20-1004
(Reading database ... 6192 files and directories currently installed.)
Removing fink-buildlock-db44-aes-4.4.20-1004 ...
Failed: phase compiling: db44-aes-4.4.20-1004 failed
</snip>

However the sipe-pidgin build wont finish building with simila errors :-(
Any suggestions - useful or directional ;-) are appreciated.
Cheers

Nicholas

-
-------------- next part --------------
An HTML attachment was scrubbed...
URL: http://pidgin.im/pipermail/support/attachments/20090414/eda7887f/attachment.htm 


More information about the Support mailing list